Target
Progesterone receptor
Ligand
BDBM50375837
Substrate
Meas. Tech.
ChEMBL_177403 (CHEMBL782725)
IC50
942±n/a nM
Citation
 Fensome, AKoko, MWrobel, JZhang, PZhang, ZCohen, JLundeen, SRudnick, KZhu, YWinneker, R Novel 5-aryl-1,3-dihydro-indole-2-thiones. potent, orally active progesterone receptor agonists. Bioorg Med Chem Lett 13:1317-20 (2003)  
Target
Name:
Progesterone receptor
Synonyms:
Nr3c3 PR Pgr Progesterone receptor
Type:
PROTEIN
Mol. Mass.:
99414.34
Organism:
Rattus norvegicus
Description:
ChEMBL_159714
Residue:
923
  
Inhibitor
Name:
BDBM50375837
Synonyms:
CHEMBL270976
Type:
Small organic molecule
Emp. Form.:
C20H18N2S
Mol. Mass.:
318.435
SMILES:
S=C1Nc2ccc(cc2C11CCCCC1)-c1cccc(c1)C#N
: