Target
Glucocorticoid receptor
Ligand
BDBM50126158
Substrate
Meas. Tech.
ChEMBL_71261 (CHEMBL685255)
IC50
35±n/a nM
Citation
 Fensome, AKoko, MWrobel, JZhang, PZhang, ZCohen, JLundeen, SRudnick, KZhu, YWinneker, R Novel 5-aryl-1,3-dihydro-indole-2-thiones. potent, orally active progesterone receptor agonists. Bioorg Med Chem Lett 13:1317-20 (2003)  
Target
Name:
Glucocorticoid receptor
Synonyms:
GCR_HUMAN GRL Glucocorticoid receptor (GRFP) Nuclear receptor subfamily 3 group C member 1
Type:
Enzyme
Mol. Mass.:
85656.87
Organism:
Homo sapiens (Human)
Description:
P04150
Residue:
777
  
Inhibitor
Name:
BDBM50126158
Synonyms:
3-fluoro-5-(2'-thioxo-1',2'-dihydrospiro[cyclohexane-1,3'-indol]-5'-yl)benzonitrile | CHEMBL28157
Type:
Small organic molecule
Emp. Form.:
C20H17FN2S
Mol. Mass.:
336.426
SMILES:
Fc1cc(cc(c1)-c1ccc2NC(=S)C3(CCCCC3)c2c1)C#N
: