Target
Progesterone receptor
Ligand
BDBM50121180
Substrate
Meas. Tech.
ChEMBL_205988 (CHEMBL810917)
IC50
56±n/a nM
Citation
 Fensome, AKoko, MWrobel, JZhang, PZhang, ZCohen, JLundeen, SRudnick, KZhu, YWinneker, R Novel 5-aryl-1,3-dihydro-indole-2-thiones. potent, orally active progesterone receptor agonists. Bioorg Med Chem Lett 13:1317-20 (2003)  
Target
Name:
Progesterone receptor
Synonyms:
NR3C3 PGR PRGR_HUMAN | progesterone
Type:
Protein
Mol. Mass.:
98979.52
Organism:
Homo sapiens (Human)
Description:
P06401
Residue:
933
  
Inhibitor
Name:
BDBM50121180
Synonyms:
5'-(3-chlorophenyl)spiro[cyclohexane-1,3'-indol]-2'(1'H)-one | CHEMBL324115
Type:
Small organic molecule
Emp. Form.:
C19H18ClNO
Mol. Mass.:
311.805
SMILES:
Clc1cccc(c1)-c1ccc2NC(=O)C3(CCCCC3)c2c1
: