Target
Progesterone receptor
Ligand
BDBM50404230
Substrate
Meas. Tech.
ChEBML_205988
EC50
1200±n/a nM
Citation
 Fensome, AKoko, MWrobel, JZhang, PZhang, ZCohen, JLundeen, SRudnick, KZhu, YWinneker, R Novel 5-aryl-1,3-dihydro-indole-2-thiones. potent, orally active progesterone receptor agonists. Bioorg Med Chem Lett 13:1317-20 (2003)  
Target
Name:
Progesterone receptor
Synonyms:
NR3C3 PGR PRGR_HUMAN | progesterone
Type:
Protein
Mol. Mass.:
98979.52
Organism:
Homo sapiens (Human)
Description:
P06401
Residue:
933
  
Inhibitor
Name:
BDBM50404230
Synonyms:
CHEMBL26755
Type:
Small organic molecule
Emp. Form.:
C22H18ClNS
Mol. Mass.:
363.903
SMILES:
CC1(Cc2ccccc2)C(=S)Nc2ccc(cc12)-c1cccc(Cl)c1
: