Target
Progesterone receptor
Ligand
BDBM50404233
Substrate
Meas. Tech.
ChEBML_205988
EC50
9.8±n/a nM
Citation
 Fensome, AKoko, MWrobel, JZhang, PZhang, ZCohen, JLundeen, SRudnick, KZhu, YWinneker, R Novel 5-aryl-1,3-dihydro-indole-2-thiones. potent, orally active progesterone receptor agonists. Bioorg Med Chem Lett 13:1317-20 (2003)  
Target
Name:
Progesterone receptor
Synonyms:
NR3C3 PGR PRGR_HUMAN | progesterone
Type:
Protein
Mol. Mass.:
98979.52
Organism:
Homo sapiens (Human)
Description:
P06401
Residue:
933
  
Inhibitor
Name:
BDBM50404233
Synonyms:
CHEMBL283759
Type:
Small organic molecule
Emp. Form.:
C18H16ClNS
Mol. Mass.:
313.844
SMILES:
Clc1cccc(c1)-c1ccc2NC(=S)C3(CCCC3)c2c1
: