Target
Progesterone receptor
Ligand
BDBM50404239
Substrate
Meas. Tech.
ChEBML_205988
EC50
0.500000±n/a nM
Citation
 Fensome, AKoko, MWrobel, JZhang, PZhang, ZCohen, JLundeen, SRudnick, KZhu, YWinneker, R Novel 5-aryl-1,3-dihydro-indole-2-thiones. potent, orally active progesterone receptor agonists. Bioorg Med Chem Lett 13:1317-20 (2003)  
Target
Name:
Progesterone receptor
Synonyms:
NR3C3 PGR PRGR_HUMAN | progesterone
Type:
Protein
Mol. Mass.:
98979.52
Organism:
Homo sapiens (Human)
Description:
P06401
Residue:
933
  
Inhibitor
Name:
BDBM50404239
Synonyms:
CHEMBL28031
Type:
Small organic molecule
Emp. Form.:
C19H18N2S2
Mol. Mass.:
338.49
SMILES:
Cc1cc(sc1-c1ccc2NC(=S)C3(CCCCC3)c2c1)C#N
: