Target
MAP kinase-interacting serine/threonine-protein kinase 2
Ligand
BDBM50562617
Substrate
Meas. Tech.
ChEMBL_2079619 (CHEMBL4735410)
Ki
11±n/a nM
Citation
 Dreas, AKucwaj-Brysz, KPyziak, KKulesza, UWincza, EFabritius, CHMichalik, KGabor-Worwa, EGo?as, AMilik, MMasiejczyk, MMajewska, EPy?niak, KWójcik-Trechci?ska, USandowska-Markiewicz, ZBrzózka, KOstrowski, JRzymski, TMikula, M Discovery of indazole-pyridinone derivatives as a novel class of potent and selective MNK1/2 kinase inhibitors that protecting against endotoxin-induced septic shock. Eur J Med Chem 213:0 (2021)  
Target
Name:
MAP kinase-interacting serine/threonine-protein kinase 2
Synonyms:
GPRK7 MAP kinase-interacting serine/threonine-protein kinase 2 (MKNK2) MAP-kinase interacting kinase 2 (MNK2) MKNK2_HUMAN | MNK2
Type:
Protein
Mol. Mass.:
51870.79
Organism:
Homo sapiens (Human)
Description:
Q9HBH9
Residue:
465
  
Inhibitor
Name:
BDBM50562617
Synonyms:
CHEMBL4752141
Type:
Small organic molecule
Emp. Form.:
C19H15FN4O
Mol. Mass.:
334.347
SMILES:
Nc1n[nH]c2cc(ccc12)-c1ccc(=O)n(Cc2ccccc2F)c1
: