Target
Glycogen synthase kinase-3 beta
Ligand
BDBM50562929
Substrate
Meas. Tech.
ChEMBL_2081048 (CHEMBL4736839)
IC50
>50000±n/a nM
Citation
 Davies, MPBenitez, RPerez, CJakupovic, SWelsby, PRzepecka, KAlder, JDavidson, CMartinez, AHayes, JM Structure-Based Design of Potent Selective Nanomolar Type-II Inhibitors of Glycogen Synthase Kinase-3?. J Med Chem 64:1497-1509 (2021)  
Target
Name:
Glycogen synthase kinase-3 beta
Synonyms:
GSK-3 beta GSK3B Glycogen synthase kinase 3 beta (GSK3B) Glycogen synthase kinase-3 beta (GSK-3B) Glycogen synthase kinase-3 beta (GSK3B) Glycogen synthase kinase-3beta (GSK3B) | Serine/threonine-protein kinase GSK3B
Type:
Enzyme
Mol. Mass.:
46756.38
Organism:
Homo sapiens (Human)
Description:
P49841
Residue:
420
  
Inhibitor
Name:
BDBM50562929
Synonyms:
CHEMBL4777246
Type:
Small organic molecule
Emp. Form.:
C22H23FN4O
Mol. Mass.:
378.4426
SMILES:
Cn1c(CO[C@H]2CN(Cc3c[nH]c4ccccc34)C[C@H]2F)nc2ccccc12
: