Target
Glycogen synthase kinase-3 beta
Ligand
BDBM50562930
Substrate
Meas. Tech.
ChEMBL_2081048 (CHEMBL4736839)
IC50
>50000±n/a nM
Citation
 Davies, MPBenitez, RPerez, CJakupovic, SWelsby, PRzepecka, KAlder, JDavidson, CMartinez, AHayes, JM Structure-Based Design of Potent Selective Nanomolar Type-II Inhibitors of Glycogen Synthase Kinase-3?. J Med Chem 64:1497-1509 (2021)  
Target
Name:
Glycogen synthase kinase-3 beta
Synonyms:
GSK-3 beta GSK3B Glycogen synthase kinase 3 beta (GSK3B) Glycogen synthase kinase-3 beta (GSK-3B) Glycogen synthase kinase-3 beta (GSK3B) Glycogen synthase kinase-3beta (GSK3B) | Serine/threonine-protein kinase GSK3B
Type:
Enzyme
Mol. Mass.:
46756.38
Organism:
Homo sapiens (Human)
Description:
P49841
Residue:
420
  
Inhibitor
Name:
BDBM50562930
Synonyms:
CHEMBL4764080
Type:
Small organic molecule
Emp. Form.:
C20H23FN4O
Mol. Mass.:
354.4212
SMILES:
Cc1cc2nc(CO[C@H]3CN(Cc4cccnc4)C[C@H]3F)[nH]c2cc1C
: