Target
Glycogen synthase kinase-3 beta
Ligand
BDBM50562932
Substrate
Meas. Tech.
ChEMBL_2081048 (CHEMBL4736839)
IC50
>50000±n/a nM
Citation
 Davies, MPBenitez, RPerez, CJakupovic, SWelsby, PRzepecka, KAlder, JDavidson, CMartinez, AHayes, JM Structure-Based Design of Potent Selective Nanomolar Type-II Inhibitors of Glycogen Synthase Kinase-3?. J Med Chem 64:1497-1509 (2021)  
Target
Name:
Glycogen synthase kinase-3 beta
Synonyms:
GSK-3 beta GSK3B Glycogen synthase kinase 3 beta (GSK3B) Glycogen synthase kinase-3 beta (GSK-3B) Glycogen synthase kinase-3 beta (GSK3B) Glycogen synthase kinase-3beta (GSK3B) | Serine/threonine-protein kinase GSK3B
Type:
Enzyme
Mol. Mass.:
46756.38
Organism:
Homo sapiens (Human)
Description:
P49841
Residue:
420
  
Inhibitor
Name:
BDBM50562932
Synonyms:
CHEMBL4781720
Type:
Small organic molecule
Emp. Form.:
C21H18F4N4O
Mol. Mass.:
418.3874
SMILES:
F[C@@H]1CN(Cc2ccc(cc2)C#N)C[C@@H]1OCc1nc2cc(ccc2[nH]1)C(F)(F)F
: