Target
Glycogen synthase kinase-3 beta
Ligand
BDBM50562945
Substrate
Meas. Tech.
ChEMBL_2081048 (CHEMBL4736839)
IC50
2080±n/a nM
Citation
 Davies, MPBenitez, RPerez, CJakupovic, SWelsby, PRzepecka, KAlder, JDavidson, CMartinez, AHayes, JM Structure-Based Design of Potent Selective Nanomolar Type-II Inhibitors of Glycogen Synthase Kinase-3?. J Med Chem 64:1497-1509 (2021)  
Target
Name:
Glycogen synthase kinase-3 beta
Synonyms:
GSK-3 beta GSK3B Glycogen synthase kinase 3 beta (GSK3B) Glycogen synthase kinase-3 beta (GSK-3B) Glycogen synthase kinase-3 beta (GSK3B) Glycogen synthase kinase-3beta (GSK3B) | Serine/threonine-protein kinase GSK3B
Type:
Enzyme
Mol. Mass.:
46756.38
Organism:
Homo sapiens (Human)
Description:
P49841
Residue:
420
  
Inhibitor
Name:
BDBM50562945
Synonyms:
CHEMBL4779572
Type:
Small organic molecule
Emp. Form.:
C24H21FN6O3
Mol. Mass.:
460.4603
SMILES:
[H][C@]12OC[C@H](Nc3nccc(n3)-c3cccc(F)c3)[C@@]1([H])OC[C@@H]2NC(=O)Nc1cccc(c1)C#N
: