Target
Bifunctional dihydrofolate reductase-thymidylate synthase
Ligand
BDBM18510
Substrate
Meas. Tech.
ChEMBL_53333 (CHEMBL664919)
IC50
110±n/a nM
Citation
 Rosowsky, AForsch, RAQueener, SF Further studies on 2,4-diamino-5-(2',5'-disubstituted benzyl)pyrimidines as potent and selective inhibitors of dihydrofolate reductases from three major opportunistic pathogens of AIDS. J Med Chem 46:1726-36 (2003)  
Target
Name:
Bifunctional dihydrofolate reductase-thymidylate synthase
Synonyms:
DHFR-TS Dihydrofolate reductase Dihydrofolate reductase; T. gondii vs rat
Type:
Enzyme
Mol. Mass.:
68757.49
Organism:
Toxoplasma gondii
Description:
Q07422
Residue:
610
  
Inhibitor
Name:
BDBM18510
Synonyms:
5-{3-[(2,4-diaminopyrimidin-5-yl)methyl]-4-methoxyphenoxy}pentanoic acid Diaminopyrimidine, 22
Type:
Small organic molecule
Emp. Form.:
C17H22N4O4
Mol. Mass.:
346.381
SMILES:
COc1ccc(OCCCCC(O)=O)cc1Cc1cnc(N)nc1N
: