Target
Geranylgeranyl transferase type-1 subunit beta
Ligand
BDBM50127310
Substrate
Meas. Tech.
ChEBML_71806
IC50
5500±n/a nM
Citation
 Tong, YLin, NHWang, LHasvold, LWang, WLeonard, NLi, TLi, QCohen, JGu, WZZhang, HStoll, VBauch, JMarsh, KRosenberg, SHSham, HL Discovery of potent imidazole and cyanophenyl containing farnesyltransferase inhibitors with improved oral bioavailability. Bioorg Med Chem Lett 13:1571-4 (2003)  
Target
Name:
Geranylgeranyl transferase type-1 subunit beta
Synonyms:
2.5.1.59 Geranylgeranyl transferase type I Geranylgeranyl transferase type I subunit beta PGGT1B Protein farnesyl/geranylgeranyl transferase | Type I protein geranyl-geranyltransferase subunit beta
Type:
Mol. Mass.:
42369.84
Organism:
Homo sapiens (Human)
Description:
Residue:
377
  
Inhibitor
Name:
BDBM50127310
Synonyms:
5-[(4-Cyano-phenyl)-(3-methyl-3H-imidazol-4-yl)-methoxymethyl]-6-naphthalen-2-yl-pyridine-2-carbonitrile | CHEMBL41515
Type:
Small organic molecule
Emp. Form.:
C29H21N5O
Mol. Mass.:
455.5099
SMILES:
Cn1cncc1C(OCc1ccc(nc1-c1ccc2ccccc2c1)C#N)c1ccc(cc1)C#N
: