Target
Chloroquine resistance transporter
Ligand
BDBM50563442
Substrate
Meas. Tech.
ChEMBL_2082532 (CHEMBL4738323)
IC50
15600±n/a nM
Citation
 Relitti, NFederico, SPozzetti, LButini, SLamponi, STaramelli, DD'Alessandro, SMartin, REShafik, SHSummers, RLBabij, SKHabluetzel, ATapanelli, SCaldelari, RGemma, SCampiani, G Synthesis and biological evaluation of benzhydryl-based antiplasmodial agents possessing Plasmodium falciparum chloroquine resistance transporter (PfCRT) inhibitory activity. Eur J Med Chem 215:0 (2021)  
Target
Name:
Chloroquine resistance transporter
Synonyms:
CRT PfCRT
Type:
PROTEIN
Mol. Mass.:
48687.29
Organism:
Plasmodium falciparum
Description:
ChEMBL_1364181
Residue:
424
  
Inhibitor
Name:
BDBM50563442
Synonyms:
CHEMBL4754685
Type:
Small organic molecule
Emp. Form.:
C50H42Cl4N6
Mol. Mass.:
868.721
SMILES:
Clc1ccc(cc1)C(Nc1ccnc2cc(Cl)ccc12)c1ccc(CN2CCN(Cc3ccc(cc3)C(Nc3ccnc4cc(Cl)ccc34)c3cccc(Cl)c3)CC2)cc1
: