Target
Histamine H3 receptor
Ligand
BDBM50120543
Substrate
Meas. Tech.
ChEBML_83646
Ki
2±n/a nM
Citation
 Chai, WBreitenbucher, JGKwok, ALi, XWong, VCarruthers, NILovenberg, TWMazur, CWilson, SJAxe, FUJones, TK Non-imidazole heterocyclic histamine H3 receptor antagonists. Bioorg Med Chem Lett 13:1767-70 (2003)  
Target
Name:
Histamine H3 receptor
Synonyms:
G-protein coupled receptor 97 HH3R HRH3 Histamine H3 receptor (H3) Histamine receptor (H3 and H4)
Type:
G Protein-Coupled Receptor (GPCR)
Mol. Mass.:
48691.47
Organism:
Homo sapiens (Human)
Description:
Binding assays were using CHO cells stably expressing hH3R receptors.
Residue:
445
  
Inhibitor
Name:
BDBM50120543
Synonyms:
7-Methyl-2-[4-(3-piperidin-1-yl-propoxy)-phenyl]-imidazo[1,2-a]pyridine | CHEMBL49532
Type:
Small organic molecule
Emp. Form.:
C22H27N3O
Mol. Mass.:
349.4693
SMILES:
Cc1ccn2cc(nc2c1)-c1ccc(OCCCN2CCCCC2)cc1
: