Target
Integrin alpha-V/beta-3
Ligand
BDBM50107397
Substrate
Meas. Tech.
ChEMBL_217799 (CHEMBL824059)
IC50
0.400000±n/a nM
Citation
 Breslin, MJDuggan, MEHalczenko, WFernandez-Metzler, CHunt, CALeu, CTMerkle, KMNaylor-Olsen, AMPrueksaritanont, TStump, GWallace, ARodan, SBHutchinson, JH Non-peptide alphavbeta3 antagonists. Part 6: design and synthesis of alphavbeta3 antagonists containing a pyridone or pyrazinone central scaffold. Bioorg Med Chem Lett 13:1809-12 (2003)  
Target
Name:
Integrin alpha-V/beta-3
Synonyms:
ITGAV/ITGB3 | Integrin beta-3/Vitronectin receptor alpha
Type:
Enzyme
Mol. Mass.:
Description:
Components:
This complex has 2 components.
Component 1
Name:
Integrin alpha-V
Synonyms:
ITAV_HUMAN Integrin alpha-V/alpha-5 VNRA Vitronectin receptor | Vitronectin receptor subunit alpha
Type:
PROTEIN
Mol. Mass.:
116024.92
Organism:
Homo sapiens (Human)
Description:
ChEMBL_582336
Residue:
1048
  
Component 2
Name:
Integrin beta-3
Synonyms:
CD_antigen=CD61 GPIIIa ITGB3 Platelet membrane glycoprotein IIIa
Type:
Protein
Mol. Mass.:
87038.91
Organism:
Homo sapiens (Human)
Description:
P05106
Residue:
788
  
Inhibitor
Name:
BDBM50107397
Synonyms:
(S)-3-(2-{(S)-2-Oxo-3-[2-(5,6,7,8-tetrahydro-[1,8]naphthyridin-2-yl)-ethyl]-pyrrolidin-1-yl}-acetylamino)-3-pyridin-3-yl-propionic acid 3-(2-{2-Oxo-3-[2-(5,6,7,8-tetrahydro-[1,8]naphthyridin-2-yl)-ethyl]-pyrrolidin-1-yl}-acetylamino)-3-pyridin-3-yl-propionic acid | CHEMBL300008
Type:
Small organic molecule
Emp. Form.:
C24H29N5O4
Mol. Mass.:
451.5182
SMILES:
OC(=O)C[C@H](NC(=O)CN1CC[C@H](CCc2ccc3CCCNc3n2)C1=O)c1cccnc1
: