Target
Methionine synthase
Ligand
BDBM50564149
Substrate
Meas. Tech.
ChEMBL_2086764 (CHEMBL4768027)
IC50
14900±n/a nM
Citation
 Wang, MTian, CXue, LLi, HCong, JFang, FYang, JYuan, MChen, YGuo, YWang, XLiu, JZhang, Z Design, synthesis and biological activity of N Eur J Med Chem 190:0 (2020)  
Target
Name:
Methionine synthase
Synonyms:
5-methyltetrahydrofolate--homocysteine methyltransferase MS Vitamin-B12 dependent methionine synthase
Type:
PROTEIN
Mol. Mass.:
140503.96
Organism:
Homo sapiens (Human)
Description:
ChEMBL_854111
Residue:
1265
  
Inhibitor
Name:
BDBM50564149
Synonyms:
CHEMBL4796741
Type:
Small organic molecule
Emp. Form.:
C17H19Cl2N5O
Mol. Mass.:
380.272
SMILES:
Nc1nc(N)c2N(C(CCc3ccc(Cl)cc3)CCc2n1)C(=O)CCl
: