Target
Neuropeptide Y receptor type 5
Ligand
BDBM50128931
Substrate
Meas. Tech.
ChEBML_144128
Ki
0.300000±n/a nM
Citation
 Hammond, MElliott, RLGillaspy, MLHager, DCHank, RFLaFlamme, JAOliver, RMDaSilva-Jardine, PAStevenson, RWMack, CMCassella, JV Structure-activity relationships in a series of NPY Y5 antagonists: 3-amido-9-ethylcarbazoles, core-modified analogues and amide isosteres. Bioorg Med Chem Lett 13:1989-92 (2003)  
Target
Name:
Neuropeptide Y receptor type 5
Synonyms:
NPY-Y5 NPY5-R NPY5R_HUMAN NPYY5 Neuropeptide Y receptor type 5 ( NPY Y5) | Y5 receptor
Type:
Enzyme
Mol. Mass.:
50746.64
Organism:
Homo sapiens (Human)
Description:
Q15761
Residue:
445
  
Inhibitor
Name:
BDBM50128931
Synonyms:
CHEMBL61880 | N-(9-Isobutyl-9H-carbazol-3-yl)-3-pyrrolidin-1-yl-propionamide
Type:
Small organic molecule
Emp. Form.:
C23H29N3O
Mol. Mass.:
363.4959
SMILES:
CC(C)Cn1c2ccccc2c2cc(NC(=O)CCN3CCCC3)ccc12
: