Target
Potassium voltage-gated channel subfamily H member 2
Ligand
BDBM50366824
Substrate
Meas. Tech.
ChEMBL_2100971 (CHEMBL4809367)
IC50
129000±n/a nM
Citation
 Lapointe, GSkepper, CKHolder, LMArmstrong, DBellamacina, CBlais, JBussiere, DBian, JCepura, CChan, HDean, CRDe Pascale, GDhumale, BFisher, LMFulsunder, MKantariya, BKim, JKing, SKossy, LKulkarni, ULakshman, JLeeds, JALing, XLvov, AMa, SMalekar, SMcKenney, DMergo, WMetzger, LMhaske, KMoser, HEMostafavi, MNamballa, SNoeske, JOsborne, CPatel, APatel, DPatel, TPiechon, PPolyakov, VPrajapati, KProsen, KRReck, FRichie, DLSanderson, MRSatasia, SSavani, BSelvarajah, JSethuraman, VShu, WTashiro, KThompson, KVVaarla, KVala, LVeselkov, DAVo, JVora, BWagner, TWedel, LWilliams, SLYendluri, SYue, QYifru, AZhang, YRivkin, A Discovery and Optimization of DNA Gyrase and Topoisomerase IV Inhibitors with Potent Activity against Fluoroquinolone-Resistant Gram-Positive Bacteria. J Med Chem 64:6329-6357 (2021)  
Target
Name:
Potassium voltage-gated channel subfamily H member 2
Synonyms:
1,3-beta-glucan synthase component GLS2 ERG Eag-related protein 1 Ether-a-go-go-related gene (HERG) Ether-a-go-go-related gene potassium channel 1 Ether-a-go-go-related gene potassium channel 1 (hERG1) Ether-a-go-go-related protein 1 H-ERG KCNH2 Potassium voltage-gated channel subfamily H member 2 (hERG) Voltage-gated potassium channel subunit Kv11.1 hERG Potassium Channel 1 | putative potassium channel subunit
Type:
Multi-pass membrane protein
Mol. Mass.:
126672.65
Organism:
Homo sapiens (Human)
Description:
Q12809
Residue:
1159
  
Inhibitor
Name:
BDBM50366824
Synonyms:
Avelox Moxifl-oxacin
Type:
Small organic molecule
Emp. Form.:
C21H24FN3O4
Mol. Mass.:
401.4314
SMILES:
COc1c(N2C[C@@H]3CCCN[C@@H]3C2)c(F)cc2c1n(cc(C(O)=O)c2=O)C1CC1
: