Target
Prostaglandin G/H synthase 2
Ligand
BDBM50566901
Substrate
Meas. Tech.
ChEMBL_2101967 (CHEMBL4810363)
IC50
226±n/a nM
Citation
 Zhang, ZGhosh, AConnolly, PJKing, PWilde, TWang, JDong, YLi, XLiao, DChen, HTian, GSuarez, JBonnette, WGPande, VDiloreto, KAShi, YPatel, SPietrak, BSzewczuk, LSensenhauser, CDallas, SEdwards, JPBachman, KEEvans, DC Gut-Restricted Selective Cyclooxygenase-2 (COX-2) Inhibitors for Chemoprevention of Colorectal Cancer. J Med Chem 64:11570-11596 (2021)  
Target
Name:
Prostaglandin G/H synthase 2
Synonyms:
COX2 Cyclooxygenase 2 (COX-2) Cyclooxygenase-2 (COX-2 AA) Cyclooxygenase-2 (COX-2) PGH2_HUMAN PHS II Prostaglandin E synthase/G/H synthase 2 Prostaglandin-endoperoxide synthase 2
Type:
Enzyme
Mol. Mass.:
69003.89
Organism:
Homo sapiens (Human)
Description:
Recombinant Cox-2 provided by Cayman (Cayman Chemical Co.,Ann Arbor, MI).
Residue:
604
  
Inhibitor
Name:
BDBM50566901
Synonyms:
CHEMBL4865464
Type:
Small organic molecule
Emp. Form.:
C21H29NO6S
Mol. Mass.:
423.523
SMILES:
CCCCOc1nc(OCC(C)(C)O)c(cc1CO)-c1ccc(cc1)S(C)(=O)=O
: