Target
Prostaglandin G/H synthase 2
Ligand
BDBM50566912
Substrate
Meas. Tech.
ChEMBL_2101986 (CHEMBL4810382)
Ki
12±n/a nM
Citation
 Zhang, ZGhosh, AConnolly, PJKing, PWilde, TWang, JDong, YLi, XLiao, DChen, HTian, GSuarez, JBonnette, WGPande, VDiloreto, KAShi, YPatel, SPietrak, BSzewczuk, LSensenhauser, CDallas, SEdwards, JPBachman, KEEvans, DC Gut-Restricted Selective Cyclooxygenase-2 (COX-2) Inhibitors for Chemoprevention of Colorectal Cancer. J Med Chem 64:11570-11596 (2021)  
Target
Name:
Prostaglandin G/H synthase 2
Synonyms:
COX2 Cyclooxygenase 2 (COX-2) Cyclooxygenase-2 (COX-2 AA) Cyclooxygenase-2 (COX-2) PGH2_HUMAN PHS II Prostaglandin E synthase/G/H synthase 2 Prostaglandin-endoperoxide synthase 2
Type:
Enzyme
Mol. Mass.:
69003.89
Organism:
Homo sapiens (Human)
Description:
Recombinant Cox-2 provided by Cayman (Cayman Chemical Co.,Ann Arbor, MI).
Residue:
604
  
Inhibitor
Name:
BDBM50566912
Synonyms:
CHEMBL4859571
Type:
Small organic molecule
Emp. Form.:
C21H26F3NO6S
Mol. Mass.:
477.494
SMILES:
CC(C)(O)COc1nc(OCCCC(F)(F)F)c(CO)cc1-c1ccc(cc1)S(C)(=O)=O
: