Target
Prostaglandin G/H synthase 1
Ligand
BDBM50566901
Substrate
Meas. Tech.
ChEMBL_2102001 (CHEMBL4810397)
IC50
>180000±n/a nM
Citation
 Zhang, ZGhosh, AConnolly, PJKing, PWilde, TWang, JDong, YLi, XLiao, DChen, HTian, GSuarez, JBonnette, WGPande, VDiloreto, KAShi, YPatel, SPietrak, BSzewczuk, LSensenhauser, CDallas, SEdwards, JPBachman, KEEvans, DC Gut-Restricted Selective Cyclooxygenase-2 (COX-2) Inhibitors for Chemoprevention of Colorectal Cancer. J Med Chem 64:11570-11596 (2021)  
Target
Name:
Prostaglandin G/H synthase 1
Synonyms:
COX-1 Cyclooxygenase Cyclooxygenase-1 (COX-1) PTGS1 | Prostaglandin G/H synthase (cyclooxygenase)
Type:
Enzyme
Mol. Mass.:
68692.62
Organism:
Homo sapiens (Human)
Description:
P23219
Residue:
599
  
Inhibitor
Name:
BDBM50566901
Synonyms:
CHEMBL4865464
Type:
Small organic molecule
Emp. Form.:
C21H29NO6S
Mol. Mass.:
423.523
SMILES:
CCCCOc1nc(OCC(C)(C)O)c(cc1CO)-c1ccc(cc1)S(C)(=O)=O
: