Target
Monoglyceride lipase
Ligand
BDBM50567002
Substrate
Meas. Tech.
ChEMBL_2102182 (CHEMBL4810578)
IC50
3.8±n/a nM
Citation
 Ikeda, SSugiyama, HTokuhara, HMurakami, MNakamura, MOguro, YAida, JMorishita, NSogabe, SDougan, DRGay, SCQin, LArimura, NTakahashi, YSasaki, MKamada, YAoyama, KKimoto, KKamata, M Design and Synthesis of Novel Spiro Derivatives as Potent and Reversible Monoacylglycerol Lipase (MAGL) Inhibitors: Bioisosteric Transformation from 3-Oxo-3,4-dihydro-2 J Med Chem 64:11014-11044 (2021)  
Target
Name:
Monoglyceride lipase
Synonyms:
HU-K5 Lysophospholipase-like MGL MGLL_HUMAN
Type:
Hydrolase
Mol. Mass.:
33264.56
Organism:
Homo sapiens (Human)
Description:
Human recombinant MGL (Cayman Chemical, cat# 10008354).
Residue:
303
  
Inhibitor
Name:
BDBM50567002
Synonyms:
CHEMBL4861633
Type:
Small organic molecule
Emp. Form.:
C19H18F6N2O4
Mol. Mass.:
452.3476
SMILES:
FC(F)(F)c1ccc(COC2CN(C2)C(=O)[C@H]2C[C@@]3(C2)COC(=O)N3)cc1C(F)(F)F
: