Target
Serine/threonine-protein kinase WNK2
Ligand
BDBM50567047
Substrate
Meas. Tech.
ChEMBL_2102257 (CHEMBL4810653)
Kd
10000±n/a nM
Citation
 Henderson, SHSorrell, FBennett, JFedorov, OHanley, MTGodoi, PHRuela de Sousa, RRobinson, SAshall-Kelly, AHopkins Navratilova, IWalter, DSElkins, JMWard, SE Discovery and Characterization of Selective and Ligand-Efficient DYRK Inhibitors. J Med Chem 64:11709-11728 (2021)  
Target
Name:
Serine/threonine-protein kinase WNK2
Synonyms:
KIAA1760 SDCCAG43 WNK2_HUMAN
Type:
Protein
Mol. Mass.:
242660.61
Organism:
Homo sapiens (Human)
Description:
Q9Y3S1
Residue:
2297
  
Inhibitor
Name:
BDBM50567047
Synonyms:
CHEMBL4848254
Type:
Small organic molecule
Emp. Form.:
C12H12N6
Mol. Mass.:
240.2639
SMILES:
CN(C)c1nccc(n1)-c1cnn2ncccc12
: