Target
Carbonic anhydrase 1
Ligand
BDBM50511586
Substrate
Meas. Tech.
ChEMBL_2104704 (CHEMBL4813207)
Ki
210±n/a nM
Citation
 Angeli, APinteala, MMaier, SSToti, ADi Cesare Mannelli, LGhelardini, CSelleri, SCarta, FSupuran, CT Tellurides bearing benzensulfonamide as carbonic anhydrase inhibitors with potent antitumor activity. Bioorg Med Chem Lett 45:0 (2021)  
Target
Name:
Carbonic anhydrase 1
Synonyms:
CA-I CAB Carbonate dehydratase I Carbonic anhydrase 1 (CA I) Carbonic anhydrase 1 (Recombinant CA I) Carbonic anhydrase B Carbonic anhydrase I (CA I) Carbonic anhydrase I (CAI) Carbonic anhydrase isoenzyme I (hCA I) | hCA
Type:
Enzyme
Mol. Mass.:
28873.37
Organism:
Homo sapiens (Human)
Description:
P00915
Residue:
261
  
Inhibitor
Name:
BDBM50511586
Synonyms:
CHEMBL4436859
Type:
Small organic molecule
Emp. Form.:
C13H13NO2STe
Mol. Mass.:
374.9
SMILES:
[#7]S(=O)(=O)c1ccc(-[#6][Te;v2]c2ccccc2)cc1
: