Target
Carbonic anhydrase 1
Ligand
BDBM50511585
Substrate
Meas. Tech.
ChEMBL_2104704 (CHEMBL4813207)
Ki
377±n/a nM
Citation
 Angeli, APinteala, MMaier, SSToti, ADi Cesare Mannelli, LGhelardini, CSelleri, SCarta, FSupuran, CT Tellurides bearing benzensulfonamide as carbonic anhydrase inhibitors with potent antitumor activity. Bioorg Med Chem Lett 45:0 (2021)  
Target
Name:
Carbonic anhydrase 1
Synonyms:
CA-I CAB Carbonate dehydratase I Carbonic anhydrase 1 (CA I) Carbonic anhydrase 1 (Recombinant CA I) Carbonic anhydrase B Carbonic anhydrase I (CA I) Carbonic anhydrase I (CAI) Carbonic anhydrase isoenzyme I (hCA I) | hCA
Type:
Enzyme
Mol. Mass.:
28873.37
Organism:
Homo sapiens (Human)
Description:
P00915
Residue:
261
  
Inhibitor
Name:
BDBM50511585
Synonyms:
CHEMBL4471819
Type:
Small organic molecule
Emp. Form.:
C16H19NO5STe
Mol. Mass.:
465
SMILES:
[#6]-[#8]-c1cc([Te;v2][#6]-c2ccc(cc2)S([#7])(=O)=O)cc(-[#8]-[#6])c1-[#8]-[#6]
: