Target
Carbonic anhydrase 7
Ligand
BDBM50511586
Substrate
Meas. Tech.
ChEMBL_2104707 (CHEMBL4813210)
Ki
8.4±n/a nM
Citation
 Angeli, APinteala, MMaier, SSToti, ADi Cesare Mannelli, LGhelardini, CSelleri, SCarta, FSupuran, CT Tellurides bearing benzensulfonamide as carbonic anhydrase inhibitors with potent antitumor activity. Bioorg Med Chem Lett 45:0 (2021)  
Target
Name:
Carbonic anhydrase 7
Synonyms:
CA-VII CAH7_HUMAN Carbonic anhydrase Carbonic anhydrase VII (CA VII)
Type:
Enzyme
Mol. Mass.:
29664.11
Organism:
Homo sapiens (Human)
Description:
Human cloned isozyme.
Residue:
264
  
Inhibitor
Name:
BDBM50511586
Synonyms:
CHEMBL4436859
Type:
Small organic molecule
Emp. Form.:
C13H13NO2STe
Mol. Mass.:
374.9
SMILES:
[#7]S(=O)(=O)c1ccc(-[#6][Te;v2]c2ccccc2)cc1
: