Target
Tyrosine-protein kinase BTK
Ligand
BDBM225238
Substrate
Meas. Tech.
ChEMBL_2104831 (CHEMBL4813334)
IC50
3.8±n/a nM
Citation
 Guilinger, JPArchna, AAugustin, MBergmann, ACentrella, PAClark, MACuozzo, JWDäther, MGuié, MAHabeshian, SKiefersauer, RKrapp, SLammens, ALercher, LLiu, JLiu, YMaskos, KMrosek, MPflügler, KSiegert, MThomson, HATian, XZhang, YKonz Makino, DLKeefe, AD Novel irreversible covalent BTK inhibitors discovered using DNA-encoded chemistry. Bioorg Med Chem 42:0 (2021)  
Target
Name:
Tyrosine-protein kinase BTK
Synonyms:
AGMX1 Agammaglobulinaemia tyrosine kinase B cell progenitor kinase BPK BTK_HUMAN Tyrosine Kinase BTK Tyrosine-protein kinase BTK (BTK)
Type:
Enzyme
Mol. Mass.:
76289.95
Organism:
Homo sapiens (Human)
Description:
Q06187
Residue:
659
  
Inhibitor
Name:
BDBM225238
Synonyms:
BTK inhibitor, 3
Type:
Small organic molecule
Emp. Form.:
C27H24N6O3
Mol. Mass.:
480.5179
SMILES:
CNC(=O)[C@H]1Cc2c(CN1C(=O)c1occc1CNc1ccc3nccnc3c1)[nH]c1ccccc21
: