Target
Lysine-specific histone demethylase 1A
Ligand
BDBM50346585
Substrate
Meas. Tech.
ChEMBL_2105753 (CHEMBL4814428)
Ki
880±n/a nM
Citation
 Dai, XJLiu, YXiong, XPXue, LPZheng, YCLiu, HM Tranylcypromine Based Lysine-Specific Demethylase 1 Inhibitor: Summary and Perspective. J Med Chem 63:14197-14215 (2020)  
Target
Name:
Lysine-specific histone demethylase 1A
Synonyms:
AOF2 Flavin-containing amine oxidase domain-containing protein 2 KDM1A KIAA0601 Lysine-specific demethylase 1 (LSD1) Lysine-specific histone demethylase 1 (LSD1)
Type:
Enzyme
Mol. Mass.:
92901.01
Organism:
Homo sapiens (Human)
Description:
O60341
Residue:
852
  
Inhibitor
Name:
BDBM50346585
Synonyms:
CHEMBL1795980 | S2101
Type:
Small organic molecule
Emp. Form.:
C16H15F2NO
Mol. Mass.:
275.2932
SMILES:
NC1CC1c1cc(F)cc(F)c1OCc1ccccc1
: