Target
Caspase-1
Ligand
BDBM50133879
Substrate
Meas. Tech.
ChEBML_46875
Ki
2680±n/a nM
Citation
 Ullman, BRAja, TDeckwerth, TLDiaz, JLHerrmann, JKalish, VJKaranewsky, DSMeduna, SPNalley, KRobinson, EDRoggo, SPSayers, ROSchmitz, ATernansky, RJTomaselli, KJWu, JC Structure-activity relationships within a series of caspase inhibitors: effect of leaving group modifications. Bioorg Med Chem Lett 13:3623-6 (2003)  
Target
Name:
Caspase-1
Synonyms:
CASP1_MOUSE Il1bc
Type:
PROTEIN
Mol. Mass.:
45636.44
Organism:
Mus musculus
Description:
ChEMBL_651546
Residue:
402
  
Inhibitor
Name:
BDBM50133879
Synonyms:
(S)-5-(Biphenyl-4-yloxy)-3-{(S)-3-methyl-2-[2-(naphthalen-1-yloxy)-acetylamino]-butyrylamino}-4-oxo-pentanoic acid | CHEMBL331689
Type:
Small organic molecule
Emp. Form.:
C34H34N2O7
Mol. Mass.:
582.643
SMILES:
CC(C)[C@H](NC(=O)COc1cccc2ccccc12)C(=O)N[C@@H](CC(O)=O)C(=O)COc1ccc(cc1)-c1ccccc1
: