Target
Melanocortin receptor 4
Ligand
BDBM50134955
Substrate
Meas. Tech.
ChEMBL_106358 (CHEMBL714438)
Ki
0.220000±n/a nM
Citation
 Balse-Srinivasan, PGrieco, PCai, MTrivedi, DHruby, VJ Structure-activity relationships of gamma-MSH analogues at the human melanocortin MC3, MC4, and MC5 receptors. Discovery of highly selective hMC3R, hMC4R, and hMC5R analogues. J Med Chem 46:4965-73 (2003)  
Target
Name:
Melanocortin receptor 4
Synonyms:
MC4-R MC4R_HUMAN Melanocortin receptor 4 (MC-4) Melanocortin receptor 4 (MC4R)
Type:
Enzyme
Mol. Mass.:
36949.50
Organism:
Homo sapiens (Human)
Description:
P32245
Residue:
332
  
Inhibitor
Name:
BDBM50134955
Synonyms:
CHEMBL2370968 | H-Tyr-Val-Nle-Gly-Pro-D-Nal(2')-Arg-Trp-Asp-Arg-Phe-Gly-NH2
Type:
Small organic molecule
Emp. Form.:
C78H104N20O15
Mol. Mass.:
1561.7854
SMILES:
CCCC[C@H](NC(=O)[C@@H](NC(=O)[C@@H](N)Cc1ccc(O)cc1)C(C)C)C(=O)NCC(=O)N1CCC[C@H]1C(=O)N[C@H](Cc1ccc2ccccc2c1)C(=O)N[C@@H](CCCN=C(N)N)C(=O)N[C@@H](Cc1c[nH]c2ccccc12)C(=O)N[C@@H](CC(O)=O)C(=O)N[C@@H](CCCN=C(N)N)C(=O)N[C@@H](Cc1ccccc1)C(=O)NCC(N)=O
: