Target
D(2) dopamine receptor
Ligand
BDBM21398
Substrate
Meas. Tech.
ChEBML_61583
IC50
0.075000±n/a nM
Citation
 Baldwin, RMFu, XKula, NSBaldessarini, RJAmici, LInnis, RBTamagnan, GD Synthesis and affinity of a possible byproduct of electrophilic radiolabeling of [123I]IBZM. Bioorg Med Chem Lett 13:4015-7 (2003)  
Target
Name:
D(2) dopamine receptor
Synonyms:
DOPAMINE D2 DOPAMINE D2 Short Dopamine D2 receptor Drd2
Type:
G Protein-Coupled Receptor (GPCR)
Mol. Mass.:
50931.60
Organism:
Rattus norvegicus (rat)
Description:
P61169
Residue:
444
  
Inhibitor
Name:
BDBM21398
Synonyms:
4-[4-(4-Chloro-phenyl)-4-hydroxy-piperidin-1-yl]-1-(4-fluoro-phenyl)-butan-1-one;propionate(HCl) CHEMBL54 Haloperidol | Haloperidol, 1
Type:
Small organic molecule
Emp. Form.:
C21H23ClFNO2
Mol. Mass.:
375.864
SMILES:
OC1(CCN(CCCC(=O)c2ccc(F)cc2)CC1)c1ccc(Cl)cc1
: