Target
D(3) dopamine receptor
Ligand
BDBM50570453
Substrate
Meas. Tech.
ChEMBL_2112203 (CHEMBL4821053)
Ki
23±n/a nM
Citation
 Gao, LHao, CChen, JMa, RZheng, LWu, QLiu, XLiu, BFZhang, GChen, YJin, J Discovery of a new class of multi-target heterocycle piperidine derivatives as potential antipsychotics with pro-cognitive effect. Bioorg Med Chem Lett 40:0 (2021)  
Target
Name:
D(3) dopamine receptor
Synonyms:
DRD3 Dopamine D3 receptor
Type:
PROTEIN
Mol. Mass.:
44213.40
Organism:
Homo sapiens
Description:
ChEMBL_105671
Residue:
400
  
Inhibitor
Name:
BDBM50570453
Synonyms:
CHEMBL4865907
Type:
Small organic molecule
Emp. Form.:
C27H35FN4O2
Mol. Mass.:
466.5908
SMILES:
CN1CCN(Cc2ccc(OCCCN3CCC(CC3)c3noc4cc(F)ccc34)cc2)CC1
: