Target
5-hydroxytryptamine receptor 2C
Ligand
BDBM50570456
Substrate
Meas. Tech.
ChEMBL_2112206 (CHEMBL4821056)
Ki
610±n/a nM
Citation
 Gao, LHao, CChen, JMa, RZheng, LWu, QLiu, XLiu, BFZhang, GChen, YJin, J Discovery of a new class of multi-target heterocycle piperidine derivatives as potential antipsychotics with pro-cognitive effect. Bioorg Med Chem Lett 40:0 (2021)  
Target
Name:
5-hydroxytryptamine receptor 2C
Synonyms:
5-HT-1C 5-HT1C 5-HTR2C 5HT2C_HUMAN HTR2C | Serotonin receptor 2C
Type:
PROTEIN
Mol. Mass.:
51820.72
Organism:
Homo sapiens
Description:
ChEMBL_104992
Residue:
458
  
Inhibitor
Name:
BDBM50570456
Synonyms:
CHEMBL4867978
Type:
Small organic molecule
Emp. Form.:
C27H34FN3O3
Mol. Mass.:
467.5756
SMILES:
Fc1ccc2c(noc2c1)C1CCN(CCCOc2ccc(CCN3CCOCC3)cc2)CC1
: