Target
Histamine H1 receptor
Ligand
BDBM50570453
Substrate
Meas. Tech.
ChEMBL_2112209 (CHEMBL4821059)
Ki
720±n/a nM
Citation
 Gao, LHao, CChen, JMa, RZheng, LWu, QLiu, XLiu, BFZhang, GChen, YJin, J Discovery of a new class of multi-target heterocycle piperidine derivatives as potential antipsychotics with pro-cognitive effect. Bioorg Med Chem Lett 40:0 (2021)  
Target
Name:
Histamine H1 receptor
Synonyms:
H1R HISTAMINE H1 HRH1_HUMAN
Type:
G Protein-Coupled Receptor (GPCR)
Mol. Mass.:
55808.72
Organism:
Homo sapiens (Human)
Description:
Cell pellets from SK-N-MC cells transfected with human H1 receptor were used in binding assay.
Residue:
487
  
Inhibitor
Name:
BDBM50570453
Synonyms:
CHEMBL4865907
Type:
Small organic molecule
Emp. Form.:
C27H35FN4O2
Mol. Mass.:
466.5908
SMILES:
CN1CCN(Cc2ccc(OCCCN3CCC(CC3)c3noc4cc(F)ccc34)cc2)CC1
: