Target
Matrix metalloproteinase-9
Ligand
BDBM50136265
Substrate
Meas. Tech.
ChEBML_105546
Ki
>2128±n/a nM
Citation
 Xue, CBHe, XRoderick, JCorbett, RLDuan, JJLiu, RQCovington, MBQian, MRibadeneira, MDVaddi, KChrist, DDNewton, RCTrzaskos, JMMagolda, RLWexler, RRDecicco, CP Rational design, synthesis and structure-activity relationships of a cyclic succinate series of TNF-alpha converting enzyme inhibitors. Part 2: lead optimization. Bioorg Med Chem Lett 13:4299-304 (2003)  
Target
Name:
Matrix metalloproteinase-9
Synonyms:
67 kDa matrix metalloproteinase-9 92 kDa gelatinase CLG4B Gelatinase B MMP9 Matrix metalloproteinase 9 (MMP-9) Matrix metalloproteinase-9 (MMP9)
Type:
Enzyme
Mol. Mass.:
78452.28
Organism:
Homo sapiens (Human)
Description:
P14780
Residue:
707
  
Inhibitor
Name:
BDBM50136265
Synonyms:
(2S,3S)-1-Ethyl-piperidine-2,3-dicarboxylic acid 3-hydroxyamide 2-{[4-(2-methyl-quinolin-4-ylmethoxy)-phenyl]-amide} | CHEMBL337849
Type:
Small organic molecule
Emp. Form.:
C26H30N4O4
Mol. Mass.:
462.5408
SMILES:
CCN1CCC[C@@H]([C@H]1C(=O)Nc1ccc(OCc2cc(C)nc3ccccc23)cc1)C(=O)NO
: