Target
Matrix metalloproteinase-9
Ligand
BDBM50136280
Substrate
Meas. Tech.
ChEBML_105546
Ki
>2128±n/a nM
Citation
 Xue, CBHe, XRoderick, JCorbett, RLDuan, JJLiu, RQCovington, MBQian, MRibadeneira, MDVaddi, KChrist, DDNewton, RCTrzaskos, JMMagolda, RLWexler, RRDecicco, CP Rational design, synthesis and structure-activity relationships of a cyclic succinate series of TNF-alpha converting enzyme inhibitors. Part 2: lead optimization. Bioorg Med Chem Lett 13:4299-304 (2003)  
Target
Name:
Matrix metalloproteinase-9
Synonyms:
67 kDa matrix metalloproteinase-9 92 kDa gelatinase CLG4B Gelatinase B MMP9 Matrix metalloproteinase 9 (MMP-9) Matrix metalloproteinase-9 (MMP9)
Type:
Enzyme
Mol. Mass.:
78452.28
Organism:
Homo sapiens (Human)
Description:
P14780
Residue:
707
  
Inhibitor
Name:
BDBM50136280
Synonyms:
(3R,4S)-1-Acetyl-piperidine-3,4-dicarboxylic acid 3-hydroxyamide 4-{[4-(7-trifluoromethyl-quinolin-4-yloxymethyl)-phenyl]-amide} | CHEMBL339380
Type:
Small organic molecule
Emp. Form.:
C26H25F3N4O5
Mol. Mass.:
530.4957
SMILES:
CC(=O)N1CC[C@@H]([C@H](C1)C(=O)NO)C(=O)Nc1ccc(COc2ccnc3cc(ccc23)C(F)(F)F)cc1
: