Target
Matrix metalloproteinase-9
Ligand
BDBM50136279
Substrate
Meas. Tech.
ChEBML_105546
Ki
252±n/a nM
Citation
 Xue, CBHe, XRoderick, JCorbett, RLDuan, JJLiu, RQCovington, MBQian, MRibadeneira, MDVaddi, KChrist, DDNewton, RCTrzaskos, JMMagolda, RLWexler, RRDecicco, CP Rational design, synthesis and structure-activity relationships of a cyclic succinate series of TNF-alpha converting enzyme inhibitors. Part 2: lead optimization. Bioorg Med Chem Lett 13:4299-304 (2003)  
Target
Name:
Matrix metalloproteinase-9
Synonyms:
67 kDa matrix metalloproteinase-9 92 kDa gelatinase CLG4B Gelatinase B MMP9 Matrix metalloproteinase 9 (MMP-9) Matrix metalloproteinase-9 (MMP9)
Type:
Enzyme
Mol. Mass.:
78452.28
Organism:
Homo sapiens (Human)
Description:
P14780
Residue:
707
  
Inhibitor
Name:
BDBM50136279
Synonyms:
(3R,4S)-3-Hydroxycarbamoyl-4-[4-(2-methyl-quinolin-4-ylmethoxy)-phenylcarbamoyl]-piperidine-1-carboxylic acid isopropyl ester | CHEMBL137383
Type:
Small organic molecule
Emp. Form.:
C28H32N4O6
Mol. Mass.:
520.5769
SMILES:
CC(C)OC(=O)N1CC[C@@H]([C@H](C1)C(=O)NO)C(=O)Nc1ccc(OCc2cc(C)nc3ccccc23)cc1
: