Target
Matrix metalloproteinase-9
Ligand
BDBM50136268
Substrate
Meas. Tech.
ChEBML_105546
Ki
306±n/a nM
Citation
 Xue, CBHe, XRoderick, JCorbett, RLDuan, JJLiu, RQCovington, MBQian, MRibadeneira, MDVaddi, KChrist, DDNewton, RCTrzaskos, JMMagolda, RLWexler, RRDecicco, CP Rational design, synthesis and structure-activity relationships of a cyclic succinate series of TNF-alpha converting enzyme inhibitors. Part 2: lead optimization. Bioorg Med Chem Lett 13:4299-304 (2003)  
Target
Name:
Matrix metalloproteinase-9
Synonyms:
67 kDa matrix metalloproteinase-9 92 kDa gelatinase CLG4B Gelatinase B MMP9 Matrix metalloproteinase 9 (MMP-9) Matrix metalloproteinase-9 (MMP9)
Type:
Enzyme
Mol. Mass.:
78452.28
Organism:
Homo sapiens (Human)
Description:
P14780
Residue:
707
  
Inhibitor
Name:
BDBM50136268
Synonyms:
(3R,4S)-1-Methanesulfonyl-piperidine-3,4-dicarboxylic acid 3-hydroxyamide 4-{[4-(2-methyl-quinolin-4-ylmethoxy)-phenyl]-amide} | CHEMBL423906
Type:
Small organic molecule
Emp. Form.:
C25H28N4O6S
Mol. Mass.:
512.578
SMILES:
Cc1cc(COc2ccc(NC(=O)[C@H]3CCN(C[C@@H]3C(=O)NO)S(C)(=O)=O)cc2)c2ccccc2n1
: