Target
Matrix metalloproteinase-9
Ligand
BDBM50136288
Substrate
Meas. Tech.
ChEBML_105546
Ki
209±n/a nM
Citation
 Xue, CBHe, XRoderick, JCorbett, RLDuan, JJLiu, RQCovington, MBQian, MRibadeneira, MDVaddi, KChrist, DDNewton, RCTrzaskos, JMMagolda, RLWexler, RRDecicco, CP Rational design, synthesis and structure-activity relationships of a cyclic succinate series of TNF-alpha converting enzyme inhibitors. Part 2: lead optimization. Bioorg Med Chem Lett 13:4299-304 (2003)  
Target
Name:
Matrix metalloproteinase-9
Synonyms:
67 kDa matrix metalloproteinase-9 92 kDa gelatinase CLG4B Gelatinase B MMP9 Matrix metalloproteinase 9 (MMP-9) Matrix metalloproteinase-9 (MMP9)
Type:
Enzyme
Mol. Mass.:
78452.28
Organism:
Homo sapiens (Human)
Description:
P14780
Residue:
707
  
Inhibitor
Name:
BDBM50136288
Synonyms:
(3R,4S)-3-Hydroxycarbamoyl-4-[4-(2-methyl-quinolin-4-ylmethoxy)-phenylcarbamoyl]-piperidine-1-carboxylic acid cyclopropyl ester | CHEMBL137365
Type:
Small organic molecule
Emp. Form.:
C28H30N4O6
Mol. Mass.:
518.561
SMILES:
Cc1cc(COc2ccc(NC(=O)[C@H]3CCN(C[C@@H]3C(=O)NO)C(=O)OC3CC3)cc2)c2ccccc2n1
: