Target
72 kDa type IV collagenase
Ligand
BDBM50136264
Substrate
Meas. Tech.
ChEBML_104561
Ki
>3333±n/a nM
Citation
 Xue, CBHe, XRoderick, JCorbett, RLDuan, JJLiu, RQCovington, MBQian, MRibadeneira, MDVaddi, KChrist, DDNewton, RCTrzaskos, JMMagolda, RLWexler, RRDecicco, CP Rational design, synthesis and structure-activity relationships of a cyclic succinate series of TNF-alpha converting enzyme inhibitors. Part 2: lead optimization. Bioorg Med Chem Lett 13:4299-304 (2003)  
Target
Name:
72 kDa type IV collagenase
Synonyms:
72 kDa gelatinase CLG4A Gelatinase A (MMP-2) MMP2_HUMAN Matrix metalloproteinase-2 (MMP 2) Matrix metalloproteinases 2 (MMP-2) | TBE-1
Type:
Enzyme
Mol. Mass.:
73870.36
Organism:
Homo sapiens (Human)
Description:
P08253
Residue:
660
  
Inhibitor
Name:
BDBM50136264
Synonyms:
(3R,4S)-1-Cyclopropylmethyl-piperidine-3,4-dicarboxylic acid 4-hydroxyamide 3-{[4-(2-methyl-quinolin-4-ylmethoxy)-phenyl]-amide} | CHEMBL133259
Type:
Small organic molecule
Emp. Form.:
C28H32N4O4
Mol. Mass.:
488.5781
SMILES:
Cc1cc(COc2ccc(NC(=O)[C@H]3CN(CC4CC4)CC[C@@H]3C(=O)NO)cc2)c2ccccc2n1
: