Target
72 kDa type IV collagenase
Ligand
BDBM50136250
Substrate
Meas. Tech.
ChEBML_104561
Ki
>3333±n/a nM
Citation
 Xue, CBHe, XRoderick, JCorbett, RLDuan, JJLiu, RQCovington, MBQian, MRibadeneira, MDVaddi, KChrist, DDNewton, RCTrzaskos, JMMagolda, RLWexler, RRDecicco, CP Rational design, synthesis and structure-activity relationships of a cyclic succinate series of TNF-alpha converting enzyme inhibitors. Part 2: lead optimization. Bioorg Med Chem Lett 13:4299-304 (2003)  
Target
Name:
72 kDa type IV collagenase
Synonyms:
72 kDa gelatinase CLG4A Gelatinase A (MMP-2) MMP2_HUMAN Matrix metalloproteinase-2 (MMP 2) Matrix metalloproteinases 2 (MMP-2) | TBE-1
Type:
Enzyme
Mol. Mass.:
73870.36
Organism:
Homo sapiens (Human)
Description:
P08253
Residue:
660
  
Inhibitor
Name:
BDBM50136250
Synonyms:
(1S,2S)-Cyclohexane-1,2-dicarboxylic acid 1-hydroxyamide 2-{[4-(quinolin-4-yloxymethyl)-phenyl]-amide} | CHEMBL135696
Type:
Small organic molecule
Emp. Form.:
C24H25N3O4
Mol. Mass.:
419.473
SMILES:
ONC(=O)[C@H]1CCCC[C@@H]1C(=O)Nc1ccc(COc2ccnc3ccccc23)cc1
: