Target
72 kDa type IV collagenase
Ligand
BDBM50136271
Substrate
Meas. Tech.
ChEBML_104561
Ki
>3333±n/a nM
Citation
 Xue, CBHe, XRoderick, JCorbett, RLDuan, JJLiu, RQCovington, MBQian, MRibadeneira, MDVaddi, KChrist, DDNewton, RCTrzaskos, JMMagolda, RLWexler, RRDecicco, CP Rational design, synthesis and structure-activity relationships of a cyclic succinate series of TNF-alpha converting enzyme inhibitors. Part 2: lead optimization. Bioorg Med Chem Lett 13:4299-304 (2003)  
Target
Name:
72 kDa type IV collagenase
Synonyms:
72 kDa gelatinase CLG4A Gelatinase A (MMP-2) MMP2_HUMAN Matrix metalloproteinase-2 (MMP 2) Matrix metalloproteinases 2 (MMP-2) | TBE-1
Type:
Enzyme
Mol. Mass.:
73870.36
Organism:
Homo sapiens (Human)
Description:
P08253
Residue:
660
  
Inhibitor
Name:
BDBM50136271
Synonyms:
(3R,4S)-1-Acetyl-piperidine-3,4-dicarboxylic acid 3-hydroxyamide 4-{[4-(quinolin-4-yloxymethyl)-phenyl]-amide} | CHEMBL134640
Type:
Small organic molecule
Emp. Form.:
C25H26N4O5
Mol. Mass.:
462.4977
SMILES:
CC(=O)N1CC[C@@H]([C@H](C1)C(=O)NO)C(=O)Nc1ccc(COc2ccnc3ccccc23)cc1
: