Target
72 kDa type IV collagenase
Ligand
BDBM50136276
Substrate
Meas. Tech.
ChEBML_104561
Ki
>3333±n/a nM
Citation
 Xue, CBHe, XRoderick, JCorbett, RLDuan, JJLiu, RQCovington, MBQian, MRibadeneira, MDVaddi, KChrist, DDNewton, RCTrzaskos, JMMagolda, RLWexler, RRDecicco, CP Rational design, synthesis and structure-activity relationships of a cyclic succinate series of TNF-alpha converting enzyme inhibitors. Part 2: lead optimization. Bioorg Med Chem Lett 13:4299-304 (2003)  
Target
Name:
72 kDa type IV collagenase
Synonyms:
72 kDa gelatinase CLG4A Gelatinase A (MMP-2) MMP2_HUMAN Matrix metalloproteinase-2 (MMP 2) Matrix metalloproteinases 2 (MMP-2) | TBE-1
Type:
Enzyme
Mol. Mass.:
73870.36
Organism:
Homo sapiens (Human)
Description:
P08253
Residue:
660
  
Inhibitor
Name:
BDBM50136276
Synonyms:
(3R,4S)-1-Cyclopropanecarbonyl-piperidine-3,4-dicarboxylic acid 3-hydroxyamide 4-{[4-(quinolin-4-ylmethoxy)-phenyl]-amide} | CHEMBL435399
Type:
Small organic molecule
Emp. Form.:
C27H28N4O5
Mol. Mass.:
488.535
SMILES:
ONC(=O)[C@H]1CN(CC[C@@H]1C(=O)Nc1ccc(OCc2ccnc3ccccc23)cc1)C(=O)C1CC1
: