Target
Cathepsin K
Ligand
BDBM50137793
Substrate
Meas. Tech.
ChEBML_45546
IC50
51±n/a nM
Citation
 Catalano, JGDeaton, DNFurfine, ESHassell, AMMcFadyen, RBMiller, ABMiller, LRShewchuk, LMWillard, DHWright, LL Exploration of the P1 SAR of aldehyde cathepsin K inhibitors. Bioorg Med Chem Lett 14:275-8 (2003)  
Target
Name:
Cathepsin K
Synonyms:
CATK_HUMAN CTSO Cathepsin O Cathepsin X
Type:
Enzyme
Mol. Mass.:
36975.68
Organism:
Homo sapiens (Human)
Description:
P43235
Residue:
329
  
Inhibitor
Name:
BDBM50137793
Synonyms:
((S)-2-Oxo-1-phenyl-ethyl)-carbamic acid tert-butyl ester | CHEMBL91968
Type:
Small organic molecule
Emp. Form.:
C13H17NO3
Mol. Mass.:
235.279
SMILES:
CC(C)(C)OC(=O)N[C@H](C=O)c1ccccc1
: