Target
Cathepsin K
Ligand
BDBM50137795
Substrate
Meas. Tech.
ChEBML_45546
IC50
160±n/a nM
Citation
 Catalano, JGDeaton, DNFurfine, ESHassell, AMMcFadyen, RBMiller, ABMiller, LRShewchuk, LMWillard, DHWright, LL Exploration of the P1 SAR of aldehyde cathepsin K inhibitors. Bioorg Med Chem Lett 14:275-8 (2003)  
Target
Name:
Cathepsin K
Synonyms:
CATK_HUMAN CTSO Cathepsin O Cathepsin X
Type:
Enzyme
Mol. Mass.:
36975.68
Organism:
Homo sapiens (Human)
Description:
P43235
Residue:
329
  
Inhibitor
Name:
BDBM50137795
Synonyms:
((S)-1-Formyl-2-methyl-propyl)-carbamic acid tert-butyl ester | CHEMBL92826
Type:
Small organic molecule
Emp. Form.:
C10H19NO3
Mol. Mass.:
201.2628
SMILES:
CC(C)[C@H](NC(=O)OC(C)(C)C)C=O
: