Target
Cathepsin K
Ligand
BDBM50137807
Substrate
Meas. Tech.
ChEBML_45546
IC50
200±n/a nM
Citation
 Catalano, JGDeaton, DNFurfine, ESHassell, AMMcFadyen, RBMiller, ABMiller, LRShewchuk, LMWillard, DHWright, LL Exploration of the P1 SAR of aldehyde cathepsin K inhibitors. Bioorg Med Chem Lett 14:275-8 (2003)  
Target
Name:
Cathepsin K
Synonyms:
CATK_HUMAN CTSO Cathepsin O Cathepsin X
Type:
Enzyme
Mol. Mass.:
36975.68
Organism:
Homo sapiens (Human)
Description:
P43235
Residue:
329
  
Inhibitor
Name:
BDBM50137807
Synonyms:
((S)-1-Methyl-2-oxo-ethyl)-carbamic acid tert-butyl ester | CHEMBL94727
Type:
Small organic molecule
Emp. Form.:
C8H15NO3
Mol. Mass.:
173.2096
SMILES:
C[C@H](NC(=O)OC(C)(C)C)C=O
: