Target
Cathepsin K
Ligand
BDBM50137808
Substrate
Meas. Tech.
ChEBML_45546
IC50
78±n/a nM
Citation
 Catalano, JGDeaton, DNFurfine, ESHassell, AMMcFadyen, RBMiller, ABMiller, LRShewchuk, LMWillard, DHWright, LL Exploration of the P1 SAR of aldehyde cathepsin K inhibitors. Bioorg Med Chem Lett 14:275-8 (2003)  
Target
Name:
Cathepsin K
Synonyms:
CATK_HUMAN CTSO Cathepsin O Cathepsin X
Type:
Enzyme
Mol. Mass.:
36975.68
Organism:
Homo sapiens (Human)
Description:
P43235
Residue:
329
  
Inhibitor
Name:
BDBM50137808
Synonyms:
((S)-1-Formyl-3-methylsulfanyl-propyl)-carbamic acid tert-butyl ester | CHEMBL91874
Type:
Small organic molecule
Emp. Form.:
C10H19NO3S
Mol. Mass.:
233.328
SMILES:
CSCC[C@H](NC(=O)OC(C)(C)C)C=O
: