Target
Cathepsin K
Ligand
BDBM50137805
Substrate
Meas. Tech.
ChEBML_45546
IC50
36±n/a nM
Citation
 Catalano, JGDeaton, DNFurfine, ESHassell, AMMcFadyen, RBMiller, ABMiller, LRShewchuk, LMWillard, DHWright, LL Exploration of the P1 SAR of aldehyde cathepsin K inhibitors. Bioorg Med Chem Lett 14:275-8 (2003)  
Target
Name:
Cathepsin K
Synonyms:
CATK_HUMAN CTSO Cathepsin O Cathepsin X
Type:
Enzyme
Mol. Mass.:
36975.68
Organism:
Homo sapiens (Human)
Description:
P43235
Residue:
329
  
Inhibitor
Name:
BDBM50137805
Synonyms:
((S)-2-Cyclohexyl-1-formyl-ethyl)-carbamic acid tert-butyl ester | CHEMBL447231
Type:
Small organic molecule
Emp. Form.:
C14H25NO3
Mol. Mass.:
255.3532
SMILES:
CC(C)(C)OC(=O)N[C@@H](CC1CCCCC1)C=O
: