Target
Cathepsin K
Ligand
BDBM50137811
Substrate
Meas. Tech.
ChEBML_45546
IC50
87±n/a nM
Citation
 Catalano, JGDeaton, DNFurfine, ESHassell, AMMcFadyen, RBMiller, ABMiller, LRShewchuk, LMWillard, DHWright, LL Exploration of the P1 SAR of aldehyde cathepsin K inhibitors. Bioorg Med Chem Lett 14:275-8 (2003)  
Target
Name:
Cathepsin K
Synonyms:
CATK_HUMAN CTSO Cathepsin O Cathepsin X
Type:
Enzyme
Mol. Mass.:
36975.68
Organism:
Homo sapiens (Human)
Description:
P43235
Residue:
329
  
Inhibitor
Name:
BDBM50137811
Synonyms:
((S)-5,5,5-Trifluoro-1-formyl-pentyl)-carbamic acid tert-butyl ester | CHEMBL94820
Type:
Small organic molecule
Emp. Form.:
C11H18F3NO3
Mol. Mass.:
269.2607
SMILES:
CC(C)(C)OC(=O)N[C@@H](CCCC(F)(F)F)C=O
: